[racket-dev] build error

From: Stephen Bloch (sbloch at adelphi.edu)
Date: Sat Jul 16 21:09:22 EDT 2011

raco setup: post-installing: racket/gui
raco setup: 
raco setup: error: during making for tests/drracket
raco setup:   /Users/bloch/programming/plt/collects/wxme/compiled/comment_rkt.dep::55: read: illegal use of "."
make[1]: *** [install-3m] Error 1
make: *** [install] Error 2

What gives?

Stephen Bloch
sbloch at adelphi.edu

Posted on the dev mailing list.