[racket-dev] release branch compile issue

From: Jordan Schatz (jordan at noionlabs.com)
Date: Tue Jan 10 11:16:23 EST 2012

When compiling from the release branch make install dies with:

racket/racketcgc -u \
          "./../collects/setup/unixstyle-install.rkt" \
          make-install-copytree "./.." \
          "/home/jordan/bin//bin" "/home/jordan/bin//lib/racket/collects" "/home/jordan/bin//share/racket/doc" "/home/jordan/bin//lib" "/home/jordan/bin//include/racket" "/home/jordan/bin//lib/racket" "/home/jordan/bin//share/man" "no"
/home/jordan/racket/collects/setup/compiled/unixstyle-install_rkt.zo::0: read (compiled): code compiled for version, not

 === context ===

make[4]: *** [copytree-run] Error 1
make[4]: Leaving directory `/home/jordan/racket/src'
make[3]: *** [install-common-middle] Error 2
make[3]: Leaving directory `/home/jordan/racket/src'
make[2]: *** [install-3m-common] Error 2
make[2]: Leaving directory `/home/jordan/racket/src'
make[1]: *** [install-3m] Error 2
make[1]: Leaving directory `/home/jordan/racket/src'
make: *** [install] Error 2

Posted on the dev mailing list.